{"text_format":"1","workbook":"xlsx","n_sheets":4,"sheets":["Daily","Gantt chart","基本設定","DATA"],"not_rendered":{"charts":0,"images":1,"macros":1,"external_links":0,"defined_names":3,"comments":1,"pivot_tables":0},"unopened":[],"bounds":{"document_bytes":16777216,"sheet_cells":100000,"rows_first":2000,"rows_last":500,"rows_between":2000,"halvings":0,"cell_chars":16384,"cell_head_chars":4096},"cells_cut":0,"cells_raw":0,"read":"whole","date_system":"1900"}

{"sheet":"Daily","index":0,"n_rows":50,"n_cols":55,"rows_kept":50,"cut":false,"hidden":false,"merged":[[38,0,39,0],[40,0,41,0],[28,0,29,0],[30,0,31,0],[32,0,33,0],[34,0,35,0],[36,0,37,0],[24,0,25,0],[26,0,27,0],[23,11,24,15],[29,1,30,5],[29,6,30,10],[23,1,24,5],[23,6,24,10],[25,1,26,5],[25,6,26,10],[27,1,28,5],[27,6,28,10],[29,11,30,15],[18,0,19,0],[20,0,21,0],[14,0,15,0],[15,1,16,5],[17,1,18,5],[21,1,22,5],[19,1,20,5],[22,0,23,0],[15,6,16,10],[15,11,16,15],[35,6,36,10],[8,0,9,0],[10,0,11,0],[12,0,13,0],[7,1,8,5],[7,6,8,10],[9,1,10,5],[9,6,10,10],[11,1,12,5],[11,6,12,10],[13,6,14,10],[6,0,7,0],[16,0,17,0],[31,11,32,15],[0,1,1,2],[27,11,28,15],[13,1,14,5],[19,6,20,10],[19,11,20,15],[7,11,8,15],[9,11,10,15],[13,11,14,15],[11,11,12,15],[17,6,18,10],[17,11,18,15],[21,6,22,10],[21,11,22,15],[25,11,26,15],[6,1,6,5],[6,6,6,10],[37,6,38,10],[37,11,38,15],[39,1,40,5],[39,6,40,10],[39,11,40,15],[44,0,45,0],[46,0,47,0],[48,0,49,0],[45,1,46,5],[45,6,46,10],[43,1,44,5],[43,6,44,10],[42,0,43,0],[31,1,32,5],[31,6,32,10],[45,11,46,15],[47,1,48,5],[47,6,48,10],[47,11,48,15],[41,1,42,5],[41,6,42,10],[41,11,42,15],[43,11,44,15],[33,1,34,5],[33,6,34,10],[33,11,34,15],[35,1,36,5],[35,11,36,15],[37,1,38,5],[6,11,6,15],[13,52,13,53],[12,52,12,53],[11,52,11,53],[2,0,2,15],[3,0,3,15],[5,1,5,5],[5,6,5,10],[5,11,5,15]]}
[1,31,null,null,null,null,null,null,null,null,null,null,null,"Weather:",null,null,null,null,"Today's Goal:",null,null,null,null,null,null,null,null,null,null,null,null,null,null,null,null,null,null,null,null,null,null,null,null,null,null,null,null,"2020/1/31：Friday"]
[null,null,null,"Friday",null,null,null,null,null,null,null,null,null,null,null,null,null,null,"Want to do:",null,null,null,null,null,null,null,null,null,null,null,null,null,null,null,"重要度：高　"]
["正直は最善の策である。 - Honesty is the best policy."]
["セルバンテス - スペインの小説家『ドン・キホーテ』著者",null,null,null,null,null,null,null,null,null,null,null,null,null,null,null,null,null,null,null,null,null,null,null,null,null,null,null,null,null,null,null,null,null,null,null,null,null,null,null,null,null,null,null,null,null,null,null,null,null,null,null,"用　　紙：A5ルーズリーフ無地"]
[]
[null,"Schedule",null,null,null,null,"Logs",null,null,null,null,"MEMO",null,null,null,null,null,null,"緊急性",null,null,null,null,null,null,null,null,null,null,null,null,null,"①","②",null,null,null,null,null,null,null,null,null,null,null,null,null,"緊急性"]
[6,null,null,null,null,null,null,null,null,null,null,null,null,null,null,null,null,null,"高",null,null,null,null,null,null,null,null,null,null,null,null,null,"③","④",null,null,null,null,null,null,null,null,null,null,null,null,null,"低",null,null,null,null,"印刷向き：孔は向かって右側にセットする"]
[]
[7,null,null,null,null,null,null,null,null,null,null,null,null,null,null,null,null,null,null,null,null,null,null,null,null,null,null,null,null,null,null,null,null,null,null,null,null,null,null,null,null,null,null,null,null,null,null,null,null,null,null,null,"印　　刷：両面印刷に設定する"]
[]
[8,null,null,null,null,null,null,null,null,null,null,null,null,null,null,null,null,null,null,null,null,null,null,null,null,null,null,null,null,null,null,null,null,null,"重要度：低　"]
[null,null,null,null,null,null,null,null,null,null,null,null,null,null,null,null,null,null,null,null,null,null,null,null,null,null,null,null,null,null,null,null,null,null,null,null,null,null,null,null,null,null,null,null,null,null,null,null,null,null,null,null,2020,null,"年"]
[9,null,null,null,null,null,null,null,null,null,null,null,null,null,null,null,null,null,null,null,null,null,null,null,null,null,null,null,null,null,null,null,null,null,null,null,null,null,null,null,null,null,null,null,null,null,null,null,null,null,null,null,2,null,"月"]
[null,null,null,null,null,null,null,null,null,null,null,null,null,null,null,null,null,null,null,null,null,null,null,null,null,null,null,null,null,null,null,null,null,null,null,null,null,null,null,null,null,null,null,null,null,null,null,null,null,null,null,null,1,null,"日"]
[10]
[]
[11]
[]
[12]
[]
[13]
[]
[14]
[]
[15]
[]
[16]
[]
[17]
[]
[18]
[]
[19]
[]
[20]
[]
[21]
[]
[22]
[]
[23]
[]
[24]
[]
[25]
[null,null,null,null,null,null,null,null,null,null,null,null,null,null,null,null,null,null,null,null,null,"Check",null,null,"　☆☆☆",null,null,"→　Next Action",null,null,null,null,null,null,null,"Shopping",null,null,null,null,null,null,"Total:",null,null,null,null,"円"]
[26]
[]
[27,null,null,null,null,null,null,null,null,null,null,null,null,null,null,null,null,null,null,null,null,"　"]
[null,null,null,null,null,null,null,null,null,null,null,null,null,null,null,null,null,null,null,null,null,"MIZUKAra -自ら「未来を切り開く能力」を育む-　https://lin.ee/zFiQfrQ"]

{"sheet":"Gantt chart","index":1,"n_rows":28,"n_cols":37,"rows_kept":28,"cut":false,"hidden":false,"merged":[[1,33,2,33]]}
[]
[null,2020,1,{"$f":"C2+1","v":2},3,4,5,6,7,8,9,10,11,12,13,14,15,16,17,18,19,20,21,22,23,24,25,26,27,28,29,null,null,"MEMO"]
[null,2,{"$f":"IFERROR(VLOOKUP($B$2&\"/\"&$B$3&\"/\"&C2,DATA!$A$9:$D$34,4,0),TEXT($B$2&\"/\"&$B$3&\"/\"&C2,\"aaa\"))","v":"土"},{"$f":"IFERROR(VLOOKUP($B$2&\"/\"&$B$3&\"/\"&D2,DATA!$A$9:$D$34,4,0),TEXT($B$2&\"/\"&$B$3&\"/\"&D2,\"aaa\"))","v":"日"},{"$f":"IFERROR(VLOOKUP($B$2&\"/\"&$B$3&\"/\"&E2,DATA!$A$9:$D$34,4,0),TEXT($B$2&\"/\"&$B$3&\"/\"&E2,\"aaa\"))","v":"月"},{"$f":"IFERROR(VLOOKUP($B$2&\"/\"&$B$3&\"/\"&F2,DATA!$A$9:$D$34,4,0),TEXT($B$2&\"/\"&$B$3&\"/\"&F2,\"aaa\"))","v":"火"},{"$f":"IFERROR(VLOOKUP($B$2&\"/\"&$B$3&\"/\"&G2,DATA!$A$9:$D$34,4,0),TEXT($B$2&\"/\"&$B$3&\"/\"&G2,\"aaa\"))","v":"水"},{"$f":"IFERROR(VLOOKUP($B$2&\"/\"&$B$3&\"/\"&H2,DATA!$A$9:$D$34,4,0),TEXT($B$2&\"/\"&$B$3&\"/\"&H2,\"aaa\"))","v":"木"},{"$f":"IFERROR(VLOOKUP($B$2&\"/\"&$B$3&\"/\"&I2,DATA!$A$9:$D$34,4,0),TEXT($B$2&\"/\"&$B$3&\"/\"&I2,\"aaa\"))","v":"金"},{"$f":"IFERROR(VLOOKUP($B$2&\"/\"&$B$3&\"/\"&J2,DATA!$A$9:$D$34,4,0),TEXT($B$2&\"/\"&$B$3&\"/\"&J2,\"aaa\"))","v":"土"},{"$f":"IFERROR(VLOOKUP($B$2&\"/\"&$B$3&\"/\"&K2,DATA!$A$9:$D$34,4,0),TEXT($B$2&\"/\"&$B$3&\"/\"&K2,\"aaa\"))","v":"日"},{"$f":"IFERROR(VLOOKUP($B$2&\"/\"&$B$3&\"/\"&L2,DATA!$A$9:$D$34,4,0),TEXT($B$2&\"/\"&$B$3&\"/\"&L2,\"aaa\"))","v":"月"},"祝",{"$f":"IFERROR(VLOOKUP($B$2&\"/\"&$B$3&\"/\"&N2,DATA!$A$9:$D$34,4,0),TEXT($B$2&\"/\"&$B$3&\"/\"&N2,\"aaa\"))","v":"水"},{"$f":"IFERROR(VLOOKUP($B$2&\"/\"&$B$3&\"/\"&O2,DATA!$A$9:$D$34,4,0),TEXT($B$2&\"/\"&$B$3&\"/\"&O2,\"aaa\"))","v":"木"},{"$f":"IFERROR(VLOOKUP($B$2&\"/\"&$B$3&\"/\"&P2,DATA!$A$9:$D$34,4,0),TEXT($B$2&\"/\"&$B$3&\"/\"&P2,\"aaa\"))","v":"金"},{"$f":"IFERROR(VLOOKUP($B$2&\"/\"&$B$3&\"/\"&Q2,DATA!$A$9:$D$34,4,0),TEXT($B$2&\"/\"&$B$3&\"/\"&Q2,\"aaa\"))","v":"土"},{"$f":"IFERROR(VLOOKUP($B$2&\"/\"&$B$3&\"/\"&R2,DATA!$A$9:$D$34,4,0),TEXT($B$2&\"/\"&$B$3&\"/\"&R2,\"aaa\"))","v":"日"},{"$f":"IFERROR(VLOOKUP($B$2&\"/\"&$B$3&\"/\"&S2,DATA!$A$9:$D$34,4,0),TEXT($B$2&\"/\"&$B$3&\"/\"&S2,\"aaa\"))","v":"月"},{"$f":"IFERROR(VLOOKUP($B$2&\"/\"&$B$3&\"/\"&T2,DATA!$A$9:$D$34,4,0),TEXT($B$2&\"/\"&$B$3&\"/\"&T2,\"aaa\"))","v":"火"},{"$f":"IFERROR(VLOOKUP($B$2&\"/\"&$B$3&\"/\"&U2,DATA!$A$9:$D$34,4,0),TEXT($B$2&\"/\"&$B$3&\"/\"&U2,\"aaa\"))","v":"水"},{"$f":"IFERROR(VLOOKUP($B$2&\"/\"&$B$3&\"/\"&V2,DATA!$A$9:$D$34,4,0),TEXT($B$2&\"/\"&$B$3&\"/\"&V2,\"aaa\"))","v":"木"},{"$f":"IFERROR(VLOOKUP($B$2&\"/\"&$B$3&\"/\"&W2,DATA!$A$9:$D$34,4,0),TEXT($B$2&\"/\"&$B$3&\"/\"&W2,\"aaa\"))","v":"金"},{"$f":"IFERROR(VLOOKUP($B$2&\"/\"&$B$3&\"/\"&X2,DATA!$A$9:$D$34,4,0),TEXT($B$2&\"/\"&$B$3&\"/\"&X2,\"aaa\"))","v":"土"},"祝","振",{"$f":"IFERROR(VLOOKUP($B$2&\"/\"&$B$3&\"/\"&AA2,DATA!$A$9:$D$34,4,0),TEXT($B$2&\"/\"&$B$3&\"/\"&AA2,\"aaa\"))","v":"火"},{"$f":"IFERROR(VLOOKUP($B$2&\"/\"&$B$3&\"/\"&AB2,DATA!$A$9:$D$34,4,0),TEXT($B$2&\"/\"&$B$3&\"/\"&AB2,\"aaa\"))","v":"水"},{"$f":"IFERROR(VLOOKUP($B$2&\"/\"&$B$3&\"/\"&AC2,DATA!$A$9:$D$34,4,0),TEXT($B$2&\"/\"&$B$3&\"/\"&AC2,\"aaa\"))","v":"木"},{"$f":"IFERROR(VLOOKUP($B$2&\"/\"&$B$3&\"/\"&AD2,DATA!$A$9:$D$34,4,0),TEXT($B$2&\"/\"&$B$3&\"/\"&AD2,\"aaa\"))","v":"金"},{"$f":"IFERROR(VLOOKUP($B$2&\"/\"&$B$3&\"/\"&AE2,DATA!$A$9:$D$34,4,0),TEXT($B$2&\"/\"&$B$3&\"/\"&AE2,\"aaa\"))","v":"土"}]
[null,"Private",null,null,null,null,null,null,null,null,null,null,null,null,null,null,null,null,null,null,null,null,null,null,null,null,null,null,null,null,null,null,null,null,null,"用　　紙：A4コピー紙"]
[null,2,null,null,null,null,null,null,null,null,null,null,null,null,null,null,null,null,null,null,null,null,null,null,null,null,null,null,null,null,null,null,null,null,null,"印刷向き：孔は向かって奥側にセットする"]
[null,3,null,null,null,null,null,null,null,null,null,null,null,null,null,null,null,null,null,null,null,null,null,null,null,null,null,null,null,null,null,null,null,null,null,"印　　刷：片面印刷に設定する"]
[null,4]
[null,5,null,null,null,null,null,null,null,null,null,null,null,null,null,null,null,null,null,null,null,null,null,null,null,null,null,null,null,null,null,null,null,null,null,2020,"年"]
[null,"Project",null,null,null,null,null,null,null,null,null,null,null,null,null,null,null,null,null,null,null,null,null,null,null,null,null,null,null,null,null,null,null,null,null,2,"月"]
[null,2]
[null,3]
[null,4]
[null,5]
[null,6]
[null,7]
[null,8]
[null,9]
[null,10]
[null,11]
[null,12]
[null,13]
[null,14]
[null,15]
[null,16]
[null,17]
[null,18]
[null,19]
[null,20]

{"sheet":"基本設定","index":2,"n_rows":16,"n_cols":6,"rows_kept":16,"cut":false,"hidden":false,"merged":[[12,5,14,11],[15,5,16,11],[4,5,5,11],[6,5,7,11],[8,5,9,11]]}
[]
[null,"記念日登録"]
[null,"年月日","記念日"]
["例","2000-04-01","結婚記念日",null,"機能説明："]
[null,null,null,null,1,"このファイルはA5サイズの手帳リフィルです。1日2ページ（見開き）タイプとして設計されています。"]
[]
[null,null,null,null,2,"左の入力欄に記念日を設定するとDAILYに自動で反映されます。また年度から記念日の年数（誕生日なら年齢）が算出されます。"]
[]
[null,null,null,null,3,"世界の名言は毎年元旦分の印刷時にランダムに並び替えられて表示されます。漫画などの名言は版権などに触れないように敢えて省いています。"]
[]
[]
[null,null,null,null,"注意事項："]
[null,null,null,null,1,"このファイルはマクロを使用しています。シート内のセルを並び替えるなどの改変はプログラムに支障をきたす恐れがあるため、ブック・シート・マクロをそれぞれロックしています。ご了承ください。"]
[]
[]
[null,null,null,null,2,"このファイルはMIZUKAraの著作制作物です。広告宣伝物として配布しています。そのため下部に公式ラインのURLが添付されます。"]

{"sheet":"DATA","index":3,"n_rows":465,"n_cols":44,"rows_kept":465,"cut":false,"hidden":true,"merged":[]}
[null,null,null,null,null,null,null,null,null,null,null,"※個人用のver4.0を基に作成しています。",null,null,null,null,null,null,null,null,null,null,null,null,null,null,null,null,null,null,null,null,null,null,null,null,null,null,null,null,null,null,null,"2019/11/1：Friday"]
[]
[null,2020,"年度",null,null,"祝日"]
[null,1,"月度",null,null,"記念日"]
["開始日",1,"日"]
["閏年",{"$f":"IF(MOD(B3,4)=0,TRUE,FALSE)","v":true}]
[null,null,null,null,null,"Anniversary List",null,null,null,null,"名言"]
["↓Vlookup用文字列","↓シリアル値",null,null,null,"↓Vlookup用文字列","↓シリアル値","↓記念日",null,null,"日付","日本語","英語","作者","備考","ランダム数"]
[{"$f":"IF(B9=\"*\",\"\",YEAR(B9)&\"/\"&MONTH(B9)&\"/\"&DAY(B9))","v":"2020/1/1"},{"$f":"DATE($B$3,1,1)","v":"2020-01-01"},"元日","祝",null,{"$f":"IF(G9=\"\",\"\",MONTH(G9)&\"/\"&DAY(G9))","v":""},{"$f":"IF(基本設定!B5=\"\",\"\",基本設定!B5)","v":""},{"$f":"IF(基本設定!C5=\"\",\"\",基本設定!C5)","v":""},{"$f":"IF(OR(G9=\"\",G9>TODAY()),\"\",DATEDIF(G9,$B$3&\"/12/31\",\"y\"))","v":""},null,"1/1","時間は飛び去り、二度と戻らない。","Time is flying never to return.","ウェルギリウス","アメリカの女優",{"$f":"RAND()","v":0.23333362601632679}]
["",{"$f":"IF(WEEKDAY(B9)=1,B9+1,\"*\")","v":"*"},"振替休日","振",null,"",{"$f":"IF(基本設定!B6=\"\",\"\",基本設定!B6)","v":""},{"$f":"IF(基本設定!C6=\"\",\"\",基本設定!C6)","v":""},"",null,"1/2","人生は人はこのマッチ箱に似ている。重大に扱うのはばかばかしい。重大に扱わねば危険である。",null,"芥川龍之介","日本の小説家",0.8146180550106954]
["2020/1/13",{"$f":"DATE(B3,1,14-WEEKDAY(DATE(B3,1,0),3))","v":"2020-01-13"},"成人の日","祝",null,"",{"$f":"IF(基本設定!B7=\"\",\"\",基本設定!B7)","v":""},{"$f":"IF(基本設定!C7=\"\",\"\",基本設定!C7)","v":""},"",null,"1/3","ひょろガリも筋肉バカもいろんなやつがいる。イコール強さだ",null,"石神千空","Dr.STONE",0.60901122871768609]
["2020/2/11",{"$f":"DATE($B$3,2,11)","v":"2020-02-11"},"建国記念の日","祝",null,"",{"$f":"IF(基本設定!B8=\"\",\"\",基本設定!B8)","v":""},{"$f":"IF(基本設定!C8=\"\",\"\",基本設定!C8)","v":""},"",null,"1/4","夢を持つと言う事は、同時に現実と闘う事になるのを覚悟すること。",null,"ばんえい競馬場の獣医さん","荒川弘『銀の匙 Silver Spoon』",0.89862837437974841]
["",{"$f":"IF(WEEKDAY(B12)=1,B12+1,\"*\")","v":"*"},"振替休日","振",null,"",{"$f":"IF(基本設定!B9=\"\",\"\",基本設定!B9)","v":""},{"$f":"IF(基本設定!C9=\"\",\"\",基本設定!C9)","v":""},"",null,"1/5","成功が上がりでもなければ、失敗が終わりでもない。肝心なのは続ける勇気である。",null,"ウィンストン・チャーチル","イギリスの政治家",0.64488799905383798]
["2020/2/23",{"$f":"DATE(B3,2,23)","v":"2020-02-23"},"天皇誕生日","祝",null,"",{"$f":"IF(基本設定!B10=\"\",\"\",基本設定!B10)","v":""},{"$f":"IF(基本設定!C10=\"\",\"\",基本設定!C10)","v":""},"",null,"1/6","私の歩みは遅いが、歩んだ道を引き返すことはない。","I walk slowly, but I never walk backward.","エイブラハム・リンカーン","アメリカの第16代大統領",0.13908548122664832]
["2020/2/24",{"$f":"IF(WEEKDAY(B14)=1,B14+1,\"*\")","v":"2020-02-24"},"振替休日","振",null,"",{"$f":"IF(基本設定!B11=\"\",\"\",基本設定!B11)","v":""},{"$f":"IF(基本設定!C11=\"\",\"\",基本設定!C11)","v":""},"",null,"1/7","空が曇っているときは、雲が横切っているだけなんだよ。","Gray skies are just clouds passing over.","デューク・エリントン","アメリカのジャズオーケストラリーダー",0.25036124420206218]
["2020/3/20",{"$f":"DATE(B3,3,INT(20.8431+0.242194*(B3-1980)-INT((B3-1980)/4)))","v":"2020-03-20"},"春分の日","祝",null,"",{"$f":"IF(基本設定!B12=\"\",\"\",基本設定!B12)","v":""},{"$f":"IF(基本設定!C12=\"\",\"\",基本設定!C12)","v":""},"",null,"1/8","夢を見るから、人生は輝く。",null,"モーツァルト","オーストリアの作曲家、演奏家",0.28053725748510983]
["",{"$f":"IF(WEEKDAY(B16)=1,B16+1,\"*\")","v":"*"},"振替休日","振",null,"",{"$f":"IF(基本設定!B13=\"\",\"\",基本設定!B13)","v":""},{"$f":"IF(基本設定!C13=\"\",\"\",基本設定!C13)","v":""},"",null,"1/9","柔軟性を持っている者は、いくら年をとっても若い者だ",null,"ユダヤのことわざ",null,0.17339646662853703]
["2020/4/29",{"$f":"DATE($B$3,4,29)","v":"2020-04-29"},"昭和の日","祝",null,"",{"$f":"IF(基本設定!B14=\"\",\"\",基本設定!B14)","v":""},{"$f":"IF(基本設定!C14=\"\",\"\",基本設定!C14)","v":""},"",null,"1/10","天才とは、1％のひらめきと99％の努力である","Genius is 1 percent inspiration and 99 percent perspiration.","トーマス・エジソン","アメリカの発明家",0.20423731972993675]
["",{"$f":"IF(WEEKDAY(B18)=1,B18+1,\"*\")","v":"*"},"振替休日","振",null,"",{"$f":"IF(基本設定!B15=\"\",\"\",基本設定!B15)","v":""},{"$f":"IF(基本設定!C15=\"\",\"\",基本設定!C15)","v":""},"",null,"1/11","あやまちの背後にはたいてい恐れが隠れている。","Mistakes are usually based in fear.","スザンヌ・サマーズ","アメリカの女優",0.72884931100328909]
["2020/5/3",{"$f":"DATE($B$3,5,3)","v":"2020-05-03"},"憲法記念日","祝",null,"",{"$f":"IF(基本設定!B16=\"\",\"\",基本設定!B16)","v":""},{"$f":"IF(基本設定!C16=\"\",\"\",基本設定!C16)","v":""},null,null,"1/12","行く手をふさがれたら、回り道で行けばいい。","When you come to a roadblock, take a detour.","メアリー・ケイ・アッシュ","アメリカの化粧品会社創業者",7.7092223823362893E-3]
["2020/5/4",{"$f":"DATE($B$3,5,4)","v":"2020-05-04"},"みどりの日","祝",null,"",{"$f":"IF(基本設定!B17=\"\",\"\",基本設定!B17)","v":""},{"$f":"IF(基本設定!C17=\"\",\"\",基本設定!C17)","v":""},null,null,"1/13","ルールに縛られた人生に 興味などないわ！！",null,"南九条あやめ","荒川弘『銀の匙 Silver Spoon』",0.81258016163499491]
["2020/5/5",{"$f":"DATE($B$3,5,5)","v":"2020-05-05"},"こどもの日","祝",null,"",{"$f":"IF(基本設定!B18=\"\",\"\",基本設定!B18)","v":""},{"$f":"IF(基本設定!C18=\"\",\"\",基本設定!C18)","v":""},null,null,"1/14","涙を流すことを恥と思う必要はまったくない。","We need never be ashamed of our tears.","チャールズ・ディケンズ","イギリスの小説家",0.85106443906521334]
["2020/5/6",{"$f":"IF(WEEKDAY(B22)<=3,B22+1,\"\")","v":"2020-05-06"},"振替休日","振",null,"",{"$f":"IF(基本設定!B19=\"\",\"\",基本設定!B19)","v":""},{"$f":"IF(基本設定!C19=\"\",\"\",基本設定!C19)","v":""},{"$f":"IF(OR(G23=\"\",G23>TODAY()),\"\",DATEDIF(G23,$B$3&\"/12/31\",\"y\"))","v":""},null,"1/15","そのうち　そのうち　べんかいしながら日がくれる",null,"相田みつを","日本の詩人、書家",0.63578000441347782]
["2020/7/20",{"$f":"DATE($B$3,7,21-WEEKDAY(DATE($B$3,7,0),3))","v":"2020-07-20"},"海の日","祝",null,"",{"$f":"IF(基本設定!B20=\"\",\"\",基本設定!B20)","v":""},{"$f":"IF(基本設定!C20=\"\",\"\",基本設定!C20)","v":""},null,null,"1/16","考えるな、感じろ。","Don’t think, feel.","ブルース・リー","香港の中国武術家、俳優",0.73786327853798206]
["2020/8/10",{"$f":"IF(OR(B3=2020,B3=2021),E25,DATE($B$3,8,11-WEEKDAY(DATE($B$3,7,0),3)))","v":"2020-08-10"},"山の日","祝",{"$f":"DATE($B$3,8,10)","v":"2020-08-10"},null,null,null,null,null,"1/17","人生について書きたいなら、まず生きなくてはならない",null,"ヘミングウェイ","アメリカの小説家",0.26380688757191939]
["",{"$f":"IF(WEEKDAY(B25)=1,B25+1,\"*\")","v":"*"},"振替休日","振",null,null,null,null,null,null,"1/18","緊張してきた。よっしゃあ！！",null,"松岡修造","日本の元プロテニスプレーヤー",0.21524887554882077]
["2020/9/21",{"$f":"DATE($B$3,9,21-WEEKDAY(DATE($B$3,9,0),3))","v":"2020-09-21"},"敬老の日","祝",null,{"$f":"IF(G27=\"\",\"\",MONTH(G27)&\"/\"&DAY(G27))","v":""},{"$f":"IF(基本設定!B21=\"\",\"\",基本設定!B21)","v":""},{"$f":"IF(基本設定!C21=\"\",\"\",基本設定!C21)","v":""},{"$f":"IF(OR(G27=\"\",G27>TODAY()),\"\",DATEDIF(G27,$B$3&\"/12/31\",\"y\"))","v":""},null,"1/19","計画のない目標は、ただの願い事にすぎない。","A goal without a plan is just a wish.","サン＝テグジュペリ","フランスの作家",0.56825159812922066]
["2020/9/22",{"$f":"DATE($B$3,9,INT(23.2488+0.242194*($B$3-1980)-INT(($B$3-1980)/4)))","v":"2020-09-22"},"秋分の日","祝",null,"",{"$f":"IF(基本設定!B22=\"\",\"\",基本設定!B22)","v":""},{"$f":"IF(基本設定!C22=\"\",\"\",基本設定!C22)","v":""},"",null,"1/20","自分ならできると信じれば、もう半分は終わったようなものだ。","Believe you can and you’re halfway there.","セオドア・ルーズベルト","アメリカの第26代大統領",0.61671202911102496]
["",{"$f":"IF(WEEKDAY(B28)=1,B28+1,\"*\")","v":"*"},"振替休日","振",null,"",{"$f":"IF(基本設定!B23=\"\",\"\",基本設定!B23)","v":""},{"$f":"IF(基本設定!C23=\"\",\"\",基本設定!C23)","v":""},"",null,"1/21","自分を信じない奴なんかに 努力する価値はない!!!",null,"マイト・ガイ","岸本斉史『NARUTO -ナルト-』",9.6562738221553368E-2]
["2020/7/23",{"$f":"IF(OR(B3=2020,B3=2021),E30,DATE($B$3,10,14-WEEKDAY(DATE($B$3,10,0),3)))","v":"2020-07-23"},"スポーツの日","祝",{"$f":"DATE($B$3,7,23)","v":"2020-07-23"},"",{"$f":"IF(基本設定!B24=\"\",\"\",基本設定!B24)","v":""},{"$f":"IF(基本設定!C24=\"\",\"\",基本設定!C24)","v":""},"",null,"1/22","事を成し遂げる者は愚直でなければならぬ。才走ってはうまくいかない。",null,"勝海舟","明治初期の武士",0.52609832574740378]
["2020/11/3",{"$f":"DATE($B$3,11,3)","v":"2020-11-03"},"文化の日","祝",null,"",{"$f":"IF(基本設定!B25=\"\",\"\",基本設定!B25)","v":""},{"$f":"IF(基本設定!C25=\"\",\"\",基本設定!C25)","v":""},"",null,"1/23","私は捜し求めない。見出すのだ。","I do not seek, I find.","パブロ・ピカソ","スペイン出身の画家、彫刻家",0.11288036469972518]
["",{"$f":"IF(WEEKDAY(B31)=1,B31+1,\"*\")","v":"*"},"振替休日","振",null,"",{"$f":"IF(基本設定!B26=\"\",\"\",基本設定!B26)","v":""},{"$f":"IF(基本設定!C26=\"\",\"\",基本設定!C26)","v":""},"",null,"1/24","困難の中に、機会がある。","In the middle of difficulty lies opportunity.","アインシュタイン","理論物理学者",0.7858901255576749]
["2020/11/23",{"$f":"DATE($B$3,11,23)","v":"2020-11-23"},"勤労感謝の日","祝",null,"",{"$f":"IF(基本設定!B27=\"\",\"\",基本設定!B27)","v":""},{"$f":"IF(基本設定!C27=\"\",\"\",基本設定!C27)","v":""},"",null,"1/25","幸せを言葉で語ると幸せを減らしてしまう。","To describe happiness is to diminish it.","スタンダール","フランスの小説家『赤と黒』著者",0.90655624408202118]
["",{"$f":"IF(WEEKDAY(B33)=1,B33+1,\"*\")","v":"*"},"振替休日","振",null,"",{"$f":"IF(基本設定!B28=\"\",\"\",基本設定!B28)","v":""},{"$f":"IF(基本設定!C28=\"\",\"\",基本設定!C28)","v":""},"",null,"1/26","我が生涯に一片の悔いなし!!",null,"ラオウ","原哲夫『北斗の拳』",0.40984743283504155]
[null,null,null,null,null,"",{"$f":"IF(基本設定!B29=\"\",\"\",基本設定!B29)","v":""},{"$f":"IF(基本設定!C29=\"\",\"\",基本設定!C29)","v":""},"",null,"1/27","知識は力なり。","Knowledge is power.","フランシス・ベーコン","イギリスの哲学者",0.61187997991883025]
[null,null,null,null,null,"",{"$f":"IF(基本設定!B30=\"\",\"\",基本設定!B30)","v":""},{"$f":"IF(基本設定!C30=\"\",\"\",基本設定!C30)","v":""},"",null,"1/28","悩みはなくならない。ただ悩みの中身が変わるだけ",null,"ロバート・J・ハヴィガースト","アメリカの教育学者",0.25457298852429799]
[null,null,null,null,null,"",{"$f":"IF(基本設定!B31=\"\",\"\",基本設定!B31)","v":""},{"$f":"IF(基本設定!C31=\"\",\"\",基本設定!C31)","v":""},"",null,"1/29","明日死ぬかのように生きよ。永遠に生きるかのように学べ",null,"ガンジー","インドの弁護士、宗教家、政治指導者",0.58081176131218271]
[null,null,null,null,null,"",{"$f":"IF(基本設定!B32=\"\",\"\",基本設定!B32)","v":""},{"$f":"IF(基本設定!C32=\"\",\"\",基本設定!C32)","v":""},"",null,"1/30","踏み出せば、その一足が道となる。",null,"アントニオ猪木","日本の元プロレスラー",0.46697428385131612]
[null,null,null,null,null,"",{"$f":"IF(基本設定!B33=\"\",\"\",基本設定!B33)","v":""},{"$f":"IF(基本設定!C33=\"\",\"\",基本設定!C33)","v":""},"",null,"1/31","私が最も恐れるものこそ、恐れである。","The thing I fear most is fear.","モンテーニュ","フランスの哲学者",0.63043216959089976]
[null,null,null,null,null,"",{"$f":"IF(基本設定!B34=\"\",\"\",基本設定!B34)","v":""},{"$f":"IF(基本設定!C34=\"\",\"\",基本設定!C34)","v":""},"",null,"2/1","学問は米をつきながらも出来るものなり。",null,"福沢諭吉","幕末から明治初期の中津藩士、啓蒙思想家、教育者",0.96890905659349347]
[null,null,null,null,null,null,null,null,null,null,"2/2","人は成功に向かってつまずく。","People fall forward to success.","メアリー・ケイ・アッシュ","アメリカの化粧品会社創業者",0.93657397762131833]
[null,null,null,null,null,null,null,null,null,null,"2/3","おれがなるって決めたんだから　その為に戦って死ぬんなら別にいい",null,"モンキー・D・ルフィ","尾田栄一郎『ONE PIECE』",0.7212065272875301]
[null,null,null,null,null,null,null,null,null,null,"2/4","希望を持たずに生きることは、死ぬことに等しい。","To live without Hope is to Cease to live.","ドストエフスキー","ロシアの小説家、思想家",0.97775141938781895]
[null,null,null,null,null,null,null,null,null,null,"2/5","待ちさえすれば、なんでもやってくるのだ。","Everything comes if a man will only wait.","ベンジャミン・ディズレーリ","イギリスの政治家、小説家",0.28854537478299569]
[null,null,null,null,null,null,null,null,null,null,"2/6","人生は勝ち負けじゃない 負けたって言わない人が勝ちなのよ",null,"坂本金八","3年Ｂ組金八先生",0.78815606053277865]
[null,null,null,null,null,null,null,null,null,null,"2/7","国王であれ、農民で在れ、家庭に平和を見出せる者が最も幸せである。",null,"ゲーテ","ドイツの詩人",0.21631373933261067]
[null,null,null,null,null,null,null,null,null,null,"2/8","おれは助けてもらわねェと生きていけねェ自信がある！！！",null,"モンキー・D・ルフィ","尾田栄一郎『ONE PIECE』",6.5884476377249035E-2]
[null,null,null,null,null,null,null,null,null,null,"2/9","志定まれば、気盛んなり。",null,"吉田松陰","幕末の長州藩士",0.93531518754381293]
[null,null,null,null,null,null,null,null,null,null,"2/10","つまらない生き方をするには、人生は短すぎる。","Life is too short to be little.","ベンジャミン・ディズレーリ","イギリスの政治家",0.26603194462935631]
[null,null,null,null,null,null,null,null,null,null,"2/11","愛さなければ、愛し方を学べない。","We can only learn to love by loving.","アイリス・マードック","アイルランドの女性作家",0.6938500484190131]
[null,null,null,null,null,null,null,null,null,null,"2/12","愛の第一の義務は、耳を傾けることである。","The first duty of love is to listen.","パウル・ティリッヒ","ドイツのプロテスタント神学者",0.65631711690669303]
[null,null,null,null,null,null,null,null,null,null,"2/13","凧が一番高く上がるのは、風に向かっている時である。","Kites rise highest against the wind – not with it.","ウィンストン・チャーチル","イギリスの政治家",0.36831092468476012]
[null,null,null,null,null,null,null,null,null,null,"2/14","お金を手にする前にお金を使うな。","Never spend your money before you have earned it.","トーマス・ジェファーソン","アメリカの第3代大統領",1.1928009535007944E-2]
[null,null,null,null,null,null,null,null,null,null,"2/15","孤独は優れた精神の持ち主の運命である。","To live alone is the fate of all great souls.","ショーペンハウアー","ドイツの哲学者",0.41358924149540488]
[null,null,null,null,null,null,null,null,null,null,"2/16","私は、自分がこれまでに読んだすべてのものの一部である。","I am a part of everything that I have read.","セオドア・ルーズベルト","アメリカの第26代大統領",8.6401938056805849E-2]
[null,null,null,null,null,null,null,null,null,null,"2/17","立って歩け　前へ進め　あんたには立派な足がついてるじゃないか ",null,"エドワード・エルリック","荒川弘『鋼の錬金術師』",0.42959259721278564]
[null,null,null,null,null,null,null,null,null,null,"2/18","事実は小説より奇なり。","Truth is always strange, stranger than fiction.","バイロン","イギリスの詩人",0.14238020158841458]
[null,null,null,null,null,null,null,null,null,null,"2/19","人生の唯一の意義は、人のために生きることである。","The sole meaning of life is to serve humanity.","トルストイ","ロシアの小説家、思想家",5.5801686317857868E-3]
[null,null,null,null,null,null,null,null,null,null,"2/20","事を成さんとすれば、知と勇と仁を蓄えねばならぬ。",null,"坂本龍馬","幕末の志士、土佐藩郷士",0.8961044153656007]
[null,null,null,null,null,null,null,null,null,null,"2/21","人は女に生まれるのではない、女になるのだ。","One is not born, but rather becomes, a woman.","ボーヴォワール","フランスの女性作家、哲学者",0.86585866418413249]
{"$rows_left_out":405}